Reaction Details
TargetCell division cycle 7-related protein kinase
LigandBDBM185848
Substrate/Competitorn/a
Meas. Tech.Inhibition Assay
pH7.5±n/a
Ki 2.25±n/a nM
Commentsextracted
Citation Akritopoulou-Zanze, IWakefield, BDMack, HTurner, SCGasiecki, AFGracias, VJSarris, KAKalvin, DMMichmerhuizen, MJShuai, QPatel, JRBakker, MHTeusch, NJohnson, EFKovar, PJDjuric, SWLong, AJVasudevan, AGeorge, DMWang, LLi, BMoore, NSHobson, ADWoods, KWMiyashiro, JMSwann, Jr., SLPenning, TD 5-substituted indazoles as kinase inhibitors US Patent US9163007 Publication Date 10/20/2015
 
Cell division cycle 7-related protein kinase
Name:Cell division cycle 7-related protein kinase
Type:Protein
Mol. Mass.:63908.16
Organism:Homo sapiens (Human)
Description:O00311
Residue:574
BDBM185848
NameBDBM185848
Synonyms:US9163007, 162
TypeSmall organic molecule
Emp. Form.C24H21N5
Mol. Mass.379.457
SMILESCc1n[nH]c2ccc(cc12)-c1nnn(Cc2ccccc2)c1-c1ccccc1C