Reaction Details
TargetCell division cycle 7-related protein kinase
LigandBDBM185849
Substrate/Competitorn/a
Meas. Tech.Inhibition Assay
pH7.5±n/a
Ki 3.4±n/a nM
Commentsextracted
Citation Akritopoulou-Zanze, IWakefield, BDMack, HTurner, SCGasiecki, AFGracias, VJSarris, KAKalvin, DMMichmerhuizen, MJShuai, QPatel, JRBakker, MHTeusch, NJohnson, EFKovar, PJDjuric, SWLong, AJVasudevan, AGeorge, DMWang, LLi, BMoore, NSHobson, ADWoods, KWMiyashiro, JMSwann, Jr., SLPenning, TD 5-substituted indazoles as kinase inhibitors US Patent US9163007 Publication Date 10/20/2015
 
Cell division cycle 7-related protein kinase
Name:Cell division cycle 7-related protein kinase
Type:Protein
Mol. Mass.:63908.16
Organism:Homo sapiens (Human)
Description:O00311
Residue:574
BDBM185849
NameBDBM185849
Synonyms:US9163007, 163
TypeSmall organic molecule
Emp. Form.C23H20N6
Mol. Mass.380.4451
SMILESCc1ccccc1-c1c(nnn1Cc1ccccc1)-c1ccc2[nH]nc(N)c2c1