Reaction Details
TargetSodium channel protein type 9 subunit alpha
LigandBDBM185916
Substrate/Competitorn/a
Meas. Tech.Electrophysiology Assay
pH7.4±n/a
Ki 78±n/a nM
Commentsextracted
Citation Ni, CShao, BTafesse, LYao, JYoungman, MPark, M Pyrimidines as sodium channel blockers US Patent US9163008 Publication Date 10/20/2015
 
Sodium channel protein type 9 subunit alpha
Name:Sodium channel protein type 9 subunit alpha
Type:Protein
Mol. Mass.:226375.97
Organism:Homo sapiens (Human)
Description:Q15858
Residue:1988
BDBM185916
NameBDBM185916
Synonyms:US9163008, 5 | US9656968, Compound 5
TypeSmall organic molecule
Emp. Form.C22H20FN5O3
Mol. Mass.421.4243
SMILESNC(=O)[C@@H]1CCCN1c1cc(nc(n1)-c1ccc(Oc2ccc(F)cc2)cc1)C(N)=O