Reaction Details
TargetCell division protein FtsZ
LigandBDBM50439496
Substrate/Competitorn/a
Meas. Tech.GTPase Activity Assay
pH6.5±n/a
Temperature298.15±n/a K
IC50 36000±7000 nM
Commentsextracted
Citation Bewley, CAWipf, P Chrysophaentin analogs that inhibit FtsZ protein US Patent US9169182 Publication Date 10/27/2015
 
Cell division protein FtsZ
Name:Cell division protein FtsZ
Type:Protein
Mol. Mass.:40305.83
Organism:Escherichia coli
Description:P0A9A6
Residue:383
BDBM50439496
NameBDBM50439496
Synonyms:CHEMBL2418096 | US9169182, J23
TypeSmall organic molecule
Emp. Form.C18H18Cl2O4
Mol. Mass.369.239
SMILESCOc1cc(C\C=C(\Cl)Cc2cc(O)cc(O)c2)c(OC)cc1Cl