Reaction Details
Target11-beta-hydroxysteroid dehydrogenase 1
LigandBDBM186136
Substrate/Competitorn/a
Meas. Tech.Scintillation Proximity Assay
Temperature298.15±n/a K
IC50 0.47±n/a nM
Commentsextracted
Citation Claremon, DATice, CMZhuang, LLeftheris, KYe, YSingh, SB Carbamate and urea inhibitors of 11β-hydroxysteroid dehydrogenase 1 US Patent US9163012 Publication Date 10/20/2015
 
11-beta-hydroxysteroid dehydrogenase 1
Name:11-beta-hydroxysteroid dehydrogenase 1
Type:Enzyme
Mol. Mass.:32409.16
Organism:Homo sapiens (Human)
Description:P28845
Residue:292
BDBM186136
NameBDBM186136
Synonyms:US9163012, 53
TypeSmall organic molecule
Emp. Form.C24H29N3O3S
Mol. Mass.439.57
SMILESCn1ccc(cc1=O)-c1csc(n1)[C@H]1CCCN1C(=O)OC1C2CC3CC(C2)CC1C3