Reaction Details
TargetSodium channel protein type 10 subunit alpha
LigandBDBM161329
Substrate/Competitorn/a
Meas. Tech.Electrophysiology Assay
IC50 1±n/a nM
Citation Anderson, CHadida-Ruah, SSGolec, JMZhang, BLittler, BJKeshavarz-Shokri, AAlacio, TEBelmont, DT Prodrugs of pyridone amides useful as modulators of sodium channels US Patent US9163042 Publication Date 10/20/2015
 
Sodium channel protein type 10 subunit alpha
Name:Sodium channel protein type 10 subunit alpha
Type:Enzyme
Mol. Mass.:219724.17
Organism:Rattus norvegicus (Rat)
Description:Q62968
Residue:1956
BDBM161329
NameBDBM161329
Synonyms:US10087143, Compound 114 US10787472, Compound 1a US9051270, 114 US9758483, Compound 114
TypeSmall organic molecule
Emp. Form.C19H13Cl2FN2O4
Mol. Mass.423.222
SMILESCOc1cc(F)ccc1Oc1cc(Cl)c(Cl)cc1C(=O)Nc1cc[nH]c(=O)c1