Reaction Details
TargetDihydrolipoyl dehydrogenase
LigandBDBM188285
Substrate/Competitorn/a
Meas. Tech.Inhibition Assay
pH7±n/a
IC50 140±10 nM
Commentsextracted
Citation Wong, CWu, Y Compounds and methods for treating tuberculosis infection US Patent US9073941 Publication Date 7/7/2015
 
Dihydrolipoyl dehydrogenase
Name:Dihydrolipoyl dehydrogenase
Type:Enzyme
Mol. Mass.:49231.98
Organism:Mycobacterium tuberculosis
Description:P9WHH9
Residue:464
BDBM188285
NameBDBM188285
Synonyms:US9073941, 604
TypeSmall organic molecule
Emp. Form.C13H9Cl2N5O2
Mol. Mass.338.149
SMILESCn1nc(nc2c1nc(=O)n(C)c2=O)-c1ccc(Cl)c(Cl)c1