Reaction Details
TargetDihydrolipoyl dehydrogenase
LigandBDBM50420474
Substrate/Competitorn/a
Meas. Tech.Inhibition Assay
pH7±n/a
IC50 60±10 nM
Commentsextracted
Citation Wong, CWu, Y Compounds and methods for treating tuberculosis infection US Patent US9073941 Publication Date 7/7/2015
 
Dihydrolipoyl dehydrogenase
Name:Dihydrolipoyl dehydrogenase
Type:Enzyme
Mol. Mass.:49231.98
Organism:Mycobacterium tuberculosis
Description:P9WHH9
Residue:464
BDBM50420474
NameBDBM50420474
Synonyms:CHEMBL2086889 | US9073941, 607
TypeSmall organic molecule
Emp. Form.C15H15N5O3
Mol. Mass.313.3113
SMILESCCn1nc(nc2c1nc(=O)n(C)c2=O)-c1ccc(OC)cc1