Reaction Details
TargetDihydrolipoyl dehydrogenase
LigandBDBM188310
Substrate/Competitorn/a
Meas. Tech.Inhibition Assay
pH7±n/a
IC50 1360±160 nM
Commentsextracted
Citation Wong, CWu, Y Compounds and methods for treating tuberculosis infection US Patent US9073941 Publication Date 7/7/2015
 
Dihydrolipoyl dehydrogenase
Name:Dihydrolipoyl dehydrogenase
Type:Enzyme
Mol. Mass.:49231.98
Organism:Mycobacterium tuberculosis
Description:P9WHH9
Residue:464
BDBM188310
NameBDBM188310
Synonyms:US9073941, 1007
TypeSmall organic molecule
Emp. Form.C21H18BrN5O2
Mol. Mass.452.304
SMILESCCCCCn1c(NC(=O)c2ccc(Br)o2)c(C#N)c2nc3ccccc3nc12