Reaction Details
TargetDihydrolipoyllysine-residue acetyltransferase component of pyruvate dehydrogenase complex
LigandBDBM188285
Substrate/Competitorn/a
Meas. Tech.Inhibition Assay
pH7±n/a
IC50<40±n/a nM
Commentsextracted
Citation Wong, CWu, Y Compounds and methods for treating tuberculosis infection US Patent US9073941 Publication Date 7/7/2015
 
Dihydrolipoyllysine-residue acetyltransferase component of pyruvate dehydrogenase complex
Name:Dihydrolipoyllysine-residue acetyltransferase component of pyruvate dehydrogenase complex
Type:Enzyme
Mol. Mass.:57069.35
Organism:Mycobacterium tuberculosis
Description:P9WIS7
Residue:553
BDBM188285
NameBDBM188285
Synonyms:US9073941, 604
TypeSmall organic molecule
Emp. Form.C13H9Cl2N5O2
Mol. Mass.338.149
SMILESCn1nc(nc2c1nc(=O)n(C)c2=O)-c1ccc(Cl)c(Cl)c1