Reaction Details
TargetDihydrolipoyllysine-residue acetyltransferase component of pyruvate dehydrogenase complex
LigandBDBM43224
Substrate/Competitorn/a
Meas. Tech.Inhibition Assay
pH7±n/a
IC50<40±n/a nM
Commentsextracted
Citation Wong, CWu, Y Compounds and methods for treating tuberculosis infection US Patent US9073941 Publication Date 7/7/2015
 
Dihydrolipoyllysine-residue acetyltransferase component of pyruvate dehydrogenase complex
Name:Dihydrolipoyllysine-residue acetyltransferase component of pyruvate dehydrogenase complex
Type:Enzyme
Mol. Mass.:57069.35
Organism:Mycobacterium tuberculosis
Description:P9WIS7
Residue:553
BDBM43224
NameBDBM43224
Synonyms:1-ethyl-6-methyl-3-[(E)-2-phenylethenyl]pyrimido[5,4-e][1,2,4]triazine-5,7-dione MLS000717146 US9073941, 609 | cid_5756371
TypeSmall organic molecule
Emp. Form.C16H15N5O2
Mol. Mass.309.3226
SMILESCCn1nc(\C=C\c2ccccc2)nc2c1nc(=O)n(C)c2=O