Reaction Details
TargetDihydrolipoyllysine-residue acetyltransferase component of pyruvate dehydrogenase complex
LigandBDBM34905
Substrate/Competitorn/a
Meas. Tech.Inhibition Assay
pH7±n/a
IC50<40±n/a nM
Commentsextracted
Citation Wong, CWu, Y Compounds and methods for treating tuberculosis infection US Patent US9073941 Publication Date 7/7/2015
 
Dihydrolipoyllysine-residue acetyltransferase component of pyruvate dehydrogenase complex
Name:Dihydrolipoyllysine-residue acetyltransferase component of pyruvate dehydrogenase complex
Type:Enzyme
Mol. Mass.:57069.35
Organism:Mycobacterium tuberculosis
Description:P9WIS7
Residue:553
BDBM34905
NameBDBM34905
Synonyms:1,6-dimethyl-3-propyl-pyrimido[5,4-e][1,2,4]triazine-5,7-dione 1,6-dimethyl-3-propylpyrimido[5,4-e][1,2,4]triazine-5,7-dione SMR000291200 cid_3164059
TypeSmall organic molecule
Emp. Form.C10H13N5O2
Mol. Mass.235.2425
SMILESCCCc1nn(C)c2nc(=O)n(C)c(=O)c2n1