Reaction Details
TargetD(4) dopamine receptor
LigandBDBM186927
Substrate/Competitorn/a
Meas. Tech.Radioligand Binding Assay
pH7.4±n/a
Ki 132±n/a nM
Commentsextracted
Citation Besnard, JHopkins, ALGilbert, IRuda, GFAbecassis, K Morpholino compounds, uses and methods US Patent US9079895 Publication Date 7/14/2015
 
D(4) dopamine receptor
Name:D(4) dopamine receptor
Type:Enzyme
Mol. Mass.:41498.73
Organism:Mus musculus (Mouse)
Description:P51436
Residue:387
BDBM186927
NameBDBM186927
Synonyms:US9079895, 19s
TypeSmall organic molecule
Emp. Form.C21H26N2O2
Mol. Mass.338.4433
SMILESC(CN1CCO[C@H](COc2ccccc2)C1)N1CCc2ccccc12