Reaction Details
TargetKappa-type opioid receptor
LigandBDBM156557
Substrate/Competitorn/a
Meas. Tech.OPRK1 antagonist assay
Temperature298.15±n/a K
IC50 0.73±n/a nM
Commentsextracted
Citation Roberts, EGuerrero, MAUrbano, MRosen, H Kappa opioid ligands US Patent US9682966 Publication Date 6/20/2017
 
Kappa-type opioid receptor
Name:Kappa-type opioid receptor
Type:G Protein-Coupled Receptor (GPCR)
Mol. Mass.:42648.76
Organism:Homo sapiens (Human)
Description:P41145
Residue:380
BDBM156557
NameBDBM156557
Synonyms:US10118915, Compound 337 | US9682966, 337
TypeSmall organic molecule
Emp. Form.C27H35N5O2
Mol. Mass.461.5991
SMILESCO[C@H]1CN(CC[C@H]1NC1CCCCC1)c1nc2ccc(C)cc2cc1-c1nc(no1)C1CC1