Reaction Details
TargetTyrosine-protein kinase BTK
LigandBDBM288460
Substrate/Competitorn/a
Meas. Tech.Btk Enzyme Activity Assay
IC50 0.390±n/a nM
Citation Liu, JKozlowski, JAAlhassan, ABoga, SBGao, XGuiadeen, DGWang, JYu, WCai, JLiu, SWang, DWu, HYang, C Benzamide imidazopyrazine Btk inhibitors US Patent US10087188 Publication Date 10/2/2018
 
Tyrosine-protein kinase BTK
Name:Tyrosine-protein kinase BTK
Type:Enzyme
Mol. Mass.:76289.95
Organism:Homo sapiens (Human)
Description:Q06187
Residue:659
BDBM288460
NameBDBM288460
Synonyms:5-[8-amino-1-(2- ethoxy-4-{[4- (trifluoromethyl) pyridin-2- yl]carbamoyl}phenyl) imidazo[1,5-a]pyrazin- 3- yl]bicyclo[3.2.2] nonane-1-carboxylic acid | US10087188, Example 67
TypeSmall organic molecule
Emp. Form.C31H31F3N6O4
Mol. Mass.608.6108
SMILESCCOc1cc(ccc1-c1nc(n2ccnc(N)c12)C12CCC(CC1)(CCC2)C(O)=O)C(=O)Nc1cc(ccn1)C(F)(F)F