Reaction Details
TargetTyrosine-protein kinase BTK
LigandBDBM288477
Substrate/Competitorn/a
Meas. Tech.Btk Enzyme Activity Assay
IC50 0.450±n/a nM
Citation Liu, JKozlowski, JAAlhassan, ABoga, SBGao, XGuiadeen, DGWang, JYu, WCai, JLiu, SWang, DWu, HYang, C Benzamide imidazopyrazine Btk inhibitors US Patent US10087188 Publication Date 10/2/2018
 
Tyrosine-protein kinase BTK
Name:Tyrosine-protein kinase BTK
Type:Enzyme
Mol. Mass.:76289.95
Organism:Homo sapiens (Human)
Description:Q06187
Residue:659
BDBM288477
NameBDBM288477
Synonyms:(1S,3R)-3-[8-amino-1- (2-ethoxy-4-{[4- (trifluoromethyl) pyridin-2- yl]carbamoyl}phenyl) imidazo[1,5-a]pyrazin- 3-yl]-1,2,2- trimethylcyclopentane carboxylic acid | US10087188, Example 84
TypeSmall organic molecule
Emp. Form.C30H31F3N6O4
Mol. Mass.596.6001
SMILESCCOc1cc(ccc1-c1nc([C@@H]2CC[C@](C)(C(O)=O)C2(C)C)n2ccnc(N)c12)C(=O)Nc1cc(ccn1)C(F)(F)F