Reaction Details
TargetTyrosine-protein kinase BTK
LigandBDBM288529
Substrate/Competitorn/a
Meas. Tech.Btk Enzyme Activity Assay
IC50 0.340±n/a nM
Citation Liu, JKozlowski, JAAlhassan, ABoga, SBGao, XGuiadeen, DGWang, JYu, WCai, JLiu, SWang, DWu, HYang, C Benzamide imidazopyrazine Btk inhibitors US Patent US10087188 Publication Date 10/2/2018
 
Tyrosine-protein kinase BTK
Name:Tyrosine-protein kinase BTK
Type:Enzyme
Mol. Mass.:76289.95
Organism:Homo sapiens (Human)
Description:Q06187
Residue:659
BDBM288529
NameBDBM288529
Synonyms:(1R,3R)-3-[8-amino- 1-(4-{[4- (trifluoromethyl) pyridin-2- yl]carbamoyl}phenyl) imidazo[1,5-a]pyrazin- 3-yl]-1,3- dimethylcyclohexane- carboxylic acid US10087188, Example 138
TypeSmall organic molecule
Emp. Form.C28H27F3N6O3
Mol. Mass.552.5476
SMILESC[C@]1(CCC[C@](C)(C1)c1nc(-c2ccc(cc2)C(=O)Nc2cc(ccn2)C(F)(F)F)c2c(N)nccn12)C(O)=O