Reaction Details
TargetTyrosine-protein kinase BTK
LigandBDBM288553
Substrate/Competitorn/a
Meas. Tech.Btk Enzyme Activity Assay
IC50 0.410±n/a nM
Citation Liu, JKozlowski, JAAlhassan, ABoga, SBGao, XGuiadeen, DGWang, JYu, WCai, JLiu, SWang, DWu, HYang, C Benzamide imidazopyrazine Btk inhibitors US Patent US10087188 Publication Date 10/2/2018
 
Tyrosine-protein kinase BTK
Name:Tyrosine-protein kinase BTK
Type:Enzyme
Mol. Mass.:76289.95
Organism:Homo sapiens (Human)
Description:Q06187
Residue:659
BDBM288553
NameBDBM288553
Synonyms:4-[8-amino-1-(2- hydroxy-4-{[4- (trifluoromethyl) pyridin-2- yl]carbamoyl}phenyl) imidazo[1,5-a]pyrazin- 3- yl]bicyclo[2.2.2] octane-1-carboxylic acid | US10087188, Example 161
TypeSmall organic molecule
Emp. Form.C28H25F3N6O4
Mol. Mass.566.5311
SMILESNc1nccn2c(nc(-c3ccc(cc3O)C(=O)Nc3cc(ccn3)C(F)(F)F)c12)C12CCC(CC1)(CC2)C(O)=O