Reaction Details
TargetInterleukin-1 receptor-associated kinase 4
LigandBDBM187584
Substrate/Competitorn/a
Meas. Tech.Inhibition Assay
pH7.2±n/a
IC50 1.4±n/a nM
Citation Santella, JBKumar, SRDuncia, JVGardner, DSPaidi, VRNair, SKHynes, JWu, HMurugesan, NSarkunam, KArunachalam, P Heteroaryl substituted nicotinamide compounds US Patent US9169252 Publication Date 10/27/2015
 
Interleukin-1 receptor-associated kinase 4
Name:Interleukin-1 receptor-associated kinase 4
Type:Protein
Mol. Mass.:51519.08
Organism:Homo sapiens (Human)
Description:Q9NWZ3
Residue:460
BDBM187584
NameBDBM187584
Synonyms:US9169252, 148
TypeSmall organic molecule
Emp. Form.C25H31N7O2
Mol. Mass.461.5593
SMILESCC(C)Nc1cc(ncc1C(=O)N[C@H]1CC[C@@H](CC1)C(C)(C)O)-n1ncc2cc(cnc12)C#N