Reaction Details
TargetInterleukin-1 receptor-associated kinase 4
LigandBDBM187816
Substrate/Competitorn/a
Meas. Tech.Inhibition Assay
pH7.2±n/a
IC50 1.3±n/a nM
Citation Santella, JBKumar, SRDuncia, JVGardner, DSPaidi, VRNair, SKHynes, JWu, HMurugesan, NSarkunam, KArunachalam, P Heteroaryl substituted nicotinamide compounds US Patent US9169252 Publication Date 10/27/2015
 
Interleukin-1 receptor-associated kinase 4
Name:Interleukin-1 receptor-associated kinase 4
Type:Protein
Mol. Mass.:51519.08
Organism:Homo sapiens (Human)
Description:Q9NWZ3
Residue:460
BDBM187816
NameBDBM187816
Synonyms:US9169252, 359
TypeSmall organic molecule
Emp. Form.C22H22ClF3N8O2
Mol. Mass.522.911
SMILESCC(C)(O)[C@H](F)CNC(=O)c1cnc(cc1Nc1cnn(CC(F)F)c1)-n1cnc2cc(Cl)cnc12