Reaction Details
TargetInterleukin-1 receptor-associated kinase 4
LigandBDBM187843
Substrate/Competitorn/a
Meas. Tech.Inhibition Assay
pH7.2±n/a
IC50 1.5±n/a nM
Citation Santella, JBKumar, SRDuncia, JVGardner, DSPaidi, VRNair, SKHynes, JWu, HMurugesan, NSarkunam, KArunachalam, P Heteroaryl substituted nicotinamide compounds US Patent US9169252 Publication Date 10/27/2015
 
Interleukin-1 receptor-associated kinase 4
Name:Interleukin-1 receptor-associated kinase 4
Type:Protein
Mol. Mass.:51519.08
Organism:Homo sapiens (Human)
Description:Q9NWZ3
Residue:460
BDBM187843
NameBDBM187843
Synonyms:US9169252, 386
TypeSmall organic molecule
Emp. Form.C24H25FN10O3
Mol. Mass.520.5189
SMILESCCNC(=O)n1cc(Nc2cc(ncc2C(=O)NC[C@@H](F)C(C)(C)O)-n2ncc3cc(cnc23)C#N)cn1