Reaction Details
TargetInterleukin-1 receptor-associated kinase 4
LigandBDBM187964
Substrate/Competitorn/a
Meas. Tech.Inhibition Assay
pH7.2±n/a
IC50 1.4±n/a nM
Citation Santella, JBKumar, SRDuncia, JVGardner, DSPaidi, VRNair, SKHynes, JWu, HMurugesan, NSarkunam, KArunachalam, P Heteroaryl substituted nicotinamide compounds US Patent US9169252 Publication Date 10/27/2015
 
Interleukin-1 receptor-associated kinase 4
Name:Interleukin-1 receptor-associated kinase 4
Type:Protein
Mol. Mass.:51519.08
Organism:Homo sapiens (Human)
Description:Q9NWZ3
Residue:460
BDBM187964
NameBDBM187964
Synonyms:US9169252, 507
TypeSmall organic molecule
Emp. Form.C22H24F2N6O2
Mol. Mass.442.4618
SMILESC[C@H](F)CNc1cc(ncc1C(=O)NC[C@@H](F)C(C)(C)O)-n1ccc2cc(cnc12)C#N