Reaction Details
TargetPantothenate kinase
LigandBDBM188490
Substrate/Competitorn/a
Meas. Tech.Biochemical Assay (ATP at 50x Km)
IC50>1.25e+4±n/a nM
Citation Björkelid, CBergfors, TRaichurkar, AKMukherjee, KMalolanarasimhan, KBandodkar, BJones, TA Structural and biochemical characterization of compounds inhibiting Mycobacterium tuberculosis pantothenate kinase. J Biol Chem288:18260-70 (2013) 
 
Pantothenate kinase
Name:Pantothenate kinase
Type:Protein
Mol. Mass.:35661.98
Organism:Mycobacterium tuberculosis ATCC 25618/H37Rv
Description:n/a
Residue:312
BDBM188490
NameBDBM188490
Synonyms:Triazole 1b
TypeSmall organic molecule
Emp. Form.C20H20ClFN4O2S
Mol. Mass.434.915
SMILESCC(NC(=O)c1ccccc1Cl)c1nnc(SCCOc2ccc(F)cc2)n1C