Reaction Details
TargetPantothenate kinase
LigandBDBM188492
Substrate/Competitorn/a
Meas. Tech.Biochemical Assay (ATP at 50x Km)
IC50 2.82e+3±n/a nM
Citation Björkelid, CBergfors, TRaichurkar, AKMukherjee, KMalolanarasimhan, KBandodkar, BJones, TA Structural and biochemical characterization of compounds inhibiting Mycobacterium tuberculosis pantothenate kinase. J Biol Chem288:18260-70 (2013) 
 
Pantothenate kinase
Name:Pantothenate kinase
Type:Protein
Mol. Mass.:35661.98
Organism:Mycobacterium tuberculosis ATCC 25618/H37Rv
Description:n/a
Residue:312
BDBM188492
NameBDBM188492
Synonyms:Triazole 1d
TypeSmall organic molecule
Emp. Form.C22H23F3N4O2S
Mol. Mass.464.504
SMILESCC(NC(=O)c1ccccc1C(F)(F)F)c1nnc(SCCOc2ccccc2C)n1C