Reaction Details
TargetGag-Pol polyprotein [A1275T]
LigandBDBM188497
Substrate/Competitorn/a
Meas. Tech.3'-Processing Assay
IC50 2.002e+5± 1.7e+4 nM
Citation Feng, LSharma, ASlaughter, AJena, NKoh, YShkriabai, NLarue, RCPatel, PAMitsuya, HKessl, JJEngelman, AFuchs, JRKvaratskhelia, M The A128T resistance mutation reveals aberrant protein multimerization as the primary mechanism of action of allosteric HIV-1 integrase inhibitors. J Biol Chem288:15813-20 (2013) 
 
Gag-Pol polyprotein [A1275T]
Name:Gag-Pol polyprotein [A1275T]
Type:Protein
Mol. Mass.:161850.08
Organism:Human immunodeficiency virus 1 (Virus)
Description:P12497[A1275T]
Residue:1435
BDBM188497
NameBDBM188497
Synonyms:2-(6-bromo-4-(4-chlorophenyl)-2-methylquinolin-3-yl)-2-(tert-butoxy)acetic acid | ALLINI-2
TypeSmall organic molecule
Emp. Form.C22H21BrClNO3
Mol. Mass.462.764
SMILESCc1nc2ccc(Br)cc2c(-c2ccc(Cl)cc2)c1C(OC(C)(C)C)C(O)=O