Reaction Details
TargetMethionine aminopeptidase 2
LigandBDBM188569
Substrate/Competitorn/a
Meas. Tech.Enzymatic Screening Assay
IC50 4.12±n/a nM
Citation Benazet, ADuclos, OGuillo, NLassalle, GMacary, KVin, V Pyrazoloquinolinone derivatives, preparation thereof and therapeutic use thereof US Patent US9169246 Publication Date 10/27/2015
 
Methionine aminopeptidase 2
Name:Methionine aminopeptidase 2
Type:Enzyme
Mol. Mass.:52884.45
Organism:Homo sapiens (Human)
Description:P50579
Residue:478
BDBM188569
NameBDBM188569
Synonyms:US9169246, 68
TypeSmall organic molecule
Emp. Form.C22H21F3N6O
Mol. Mass.442.4369
SMILESCN1CCN(CC1)c1cc(ccn1)-c1ccc2c3[nH]ncc3c(=O)n(CC(F)(F)F)c2c1