Reaction Details
TargetMethionine aminopeptidase 2
LigandBDBM188693
Substrate/Competitorn/a
Meas. Tech.Enzymatic Screening Assay
IC50 4.99±n/a nM
Citation Benazet, ADuclos, OGuillo, NLassalle, GMacary, KVin, V Pyrazoloquinolinone derivatives, preparation thereof and therapeutic use thereof US Patent US9169246 Publication Date 10/27/2015
 
Methionine aminopeptidase 2
Name:Methionine aminopeptidase 2
Type:Enzyme
Mol. Mass.:52884.45
Organism:Homo sapiens (Human)
Description:P50579
Residue:478
BDBM188693
NameBDBM188693
Synonyms:US9169246, 235
TypeSmall organic molecule
Emp. Form.C22H22F3N5O3S
Mol. Mass.493.502
SMILESCN(C)CCS(=O)(=O)Nc1ccccc1-c1ccc2c3[nH]ncc3c(=O)n(CC(F)(F)F)c2c1