Reaction Details
TargetInterleukin-1 receptor-associated kinase 4
LigandBDBM188791
Substrate/Competitorn/a
Meas. Tech.Kinase Assay
pH7.2±n/a
IC50<100±n/a nM
Commentsextracted
Citation McElroy, WTLi, GHo, GDTan, ZPaliwal, SSeganish, WMTulshian, DLampe, JMethot, JLZhou, HAltman, MDZhu, L Amidopyrazole inhibitors of interleukin receptor-associated kinases US Patent US9169260 Publication Date 10/27/2015
 
Interleukin-1 receptor-associated kinase 4
Name:Interleukin-1 receptor-associated kinase 4
Type:Protein
Mol. Mass.:51519.08
Organism:Homo sapiens (Human)
Description:Q9NWZ3
Residue:460
BDBM188791
NameBDBM188791
Synonyms:US9169260, 57
TypeSmall organic molecule
Emp. Form.C23H24FN7O3S
Mol. Mass.497.545
SMILESCc1ccc(c(F)c1)-n1nc(cc1NC(=O)c1cnn2cccnc12)C1CCN(CC1)S(C)(=O)=O