Reaction Details
TargetInterleukin-1 receptor-associated kinase 4
LigandBDBM188835
Substrate/Competitorn/a
Meas. Tech.Kinase Assay
pH7.2±n/a
IC50<100±n/a nM
Commentsextracted
Citation McElroy, WTLi, GHo, GDTan, ZPaliwal, SSeganish, WMTulshian, DLampe, JMethot, JLZhou, HAltman, MDZhu, L Amidopyrazole inhibitors of interleukin receptor-associated kinases US Patent US9169260 Publication Date 10/27/2015
 
Interleukin-1 receptor-associated kinase 4
Name:Interleukin-1 receptor-associated kinase 4
Type:Protein
Mol. Mass.:51519.08
Organism:Homo sapiens (Human)
Description:Q9NWZ3
Residue:460
BDBM188835
NameBDBM188835
Synonyms:US9169260, 101
TypeSmall organic molecule
Emp. Form.C26H21FN6O
Mol. Mass.452.4829
SMILESCc1ccc(cc1)-c1cc(NC(=O)c2cnn3cccnc23)n(n1)-c1ccc(cc1F)C1CC1