Reaction Details
TargetInterleukin-1 receptor-associated kinase 4
LigandBDBM189006
Substrate/Competitorn/a
Meas. Tech.Kinase Assay
pH7.2±n/a
IC50<100±n/a nM
Commentsextracted
Citation McElroy, WTLi, GHo, GDTan, ZPaliwal, SSeganish, WMTulshian, DLampe, JMethot, JLZhou, HAltman, MDZhu, L Amidopyrazole inhibitors of interleukin receptor-associated kinases US Patent US9169260 Publication Date 10/27/2015
 
Interleukin-1 receptor-associated kinase 4
Name:Interleukin-1 receptor-associated kinase 4
Type:Protein
Mol. Mass.:51519.08
Organism:Homo sapiens (Human)
Description:Q9NWZ3
Residue:460
BDBM189006
NameBDBM189006
Synonyms:US9169260, 272
TypeSmall organic molecule
Emp. Form.C27H32N8O
Mol. Mass.484.596
SMILESCC1CCC(C1)N1CCC(CC1)c1cc(NC(=O)c2cnn3cccnc23)n(n1)-c1ccc(C)cn1