Reaction Details
TargetGlycogen synthase kinase-3 beta
LigandBDBM189386
Substrate/Competitorn/a
Meas. Tech.Kinase-Glo Assay
Temperature303.15±n/a K
IC50 3.1e+2± 3e+1 nM
Commentsextracted
Citation Tantray, MAKhan, IHamid, HAlam, MSUmar, SAli, YSharma, KHussain, F Synthesis of Novel Oxazolo[4,5-b]pyridine-2-one based 1,2,3-triazoles as Glycogen Synthase Kinase-3ß Inhibitors with Anti-inflammatory Potential. Chem Biol Drug Des87:918-26 (2016) 
 
Glycogen synthase kinase-3 beta
Name:Glycogen synthase kinase-3 beta
Type:Enzyme
Mol. Mass.:46756.38
Organism:Homo sapiens (Human)
Description:P49841
Residue:420
BDBM189386
NameBDBM189386
Synonyms:3-((1-(2-bromophenyl)-1H-1,2,3-triazol-4-yl)methyl)oxazolo[4,5-b]pyridin-2(3H)-one (4f)
TypeSmall organic molecule
Emp. Form.C15H10BrN5O2
Mol. Mass.372.176
SMILESBrc1ccccc1-n1cc(Cn2c3ncccc3oc2=O)nn1