Reaction Details
TargetGlycogen synthase kinase-3 beta
LigandBDBM2579
Substrate/Competitorn/a
Meas. Tech.Kinase-Glo Assay
Temperature303.15±n/a K
IC50 6e+1± 1e+1 nM
Commentsextracted
Citation Tantray, MAKhan, IHamid, HAlam, MSUmar, SAli, YSharma, KHussain, F Synthesis of Novel Oxazolo[4,5-b]pyridine-2-one based 1,2,3-triazoles as Glycogen Synthase Kinase-3ß Inhibitors with Anti-inflammatory Potential. Chem Biol Drug Des87:918-26 (2016) 
 
Glycogen synthase kinase-3 beta
Name:Glycogen synthase kinase-3 beta
Type:Enzyme
Mol. Mass.:46756.38
Organism:Homo sapiens (Human)
Description:P49841
Residue:420
BDBM2579
NameBDBM2579
Synonyms:(2S,3R,4R,6R)-3-methoxy-2-methyl-4-(methylamino)-29-oxa-1,7,17-triazaoctacyclo[12.12.2.1^{2,6}.0^{7,28}.0^{8,13}.0^{15,19}.0^{20,27}.0^{21,26}]nonacosa-8(13),9,11,14(28),15(19),20(27),21(26),22,24-nonaen-16-one Staurosporin, 4 Staurosporine, 8 US9206188, Staurosporine | US9226923, Staurosporine
TypeSmall organic molecule
Emp. Form.C28H26N4O3
Mol. Mass.466.531
SMILESCN[C@@H]1C[C@H]2O[C@@](C)([C@@H]1OC)n1c3ccccc3c3c4CNC(=O)c4c4c5ccccc5n2c4c13