Reaction Details
TargetApoptosis regulator Bcl-2
LigandBDBM189672
Substrate/Competitorn/a
Meas. Tech.Time Resolved-Fluorescence Resonance Energy Transfer (TR-FRET) Assay
Temperature298.15±n/a K
Ki<0.01±n/a nM
Commentsextracted
Citation Bruncko, MDing, HDoherty, GAElmore, SWHasvold, LAHexamer, LKunzer, ARSong, XSouers, AJSullivan, GMTao, ZWang, GTWang, LWang, XWendt, MDMantei, RAHansen, TM Apoptosis-inducing agents for the treatment of cancer and immune and autoimmune diseases US Patent US9174982 Publication Date 11/3/2015
 
Apoptosis regulator Bcl-2
Name:Apoptosis regulator Bcl-2
Type:Homodimer or heterodimer
Mol. Mass.:26269.11
Organism:Homo sapiens (Human)
Description:P10415
Residue:239
BDBM189672
NameBDBM189672
Synonyms:US10213433, Compound 241 US20240043404, Example 241 | US9174982, 241
TypeSmall organic molecule
Emp. Form.C48H53ClF3N7O8S2
Mol. Mass.1012.555
SMILESCC1(C)CCC(CN2CCN(CC2)c2ccc(C(=O)NS(=O)(=O)c3ccc(NCC4CN(CCO4)C4COC4)c(c3)S(=O)(=O)C(F)(F)F)c(Oc3cnc4[nH]ccc4c3)c2)=C(C1)c1ccc(Cl)cc1