Reaction Details
TargetApoptosis regulator Bcl-2
LigandBDBM189715
Substrate/Competitorn/a
Meas. Tech.Time Resolved-Fluorescence Resonance Energy Transfer (TR-FRET) Assay
Temperature298.15±n/a K
Ki<0.01±n/a nM
Commentsextracted
Citation Bruncko, MDing, HDoherty, GAElmore, SWHasvold, LAHexamer, LKunzer, ARSong, XSouers, AJSullivan, GMTao, ZWang, GTWang, LWang, XWendt, MDMantei, RAHansen, TM Apoptosis-inducing agents for the treatment of cancer and immune and autoimmune diseases US Patent US9174982 Publication Date 11/3/2015
 
Apoptosis regulator Bcl-2
Name:Apoptosis regulator Bcl-2
Type:Homodimer or heterodimer
Mol. Mass.:26269.11
Organism:Homo sapiens (Human)
Description:P10415
Residue:239
BDBM189715
NameBDBM189715
Synonyms:US10213433, Compound 285 US20240043404, Example 285 | US9174982, 285
TypeSmall organic molecule
Emp. Form.C46H50Cl2F3N7O5S
Mol. Mass.940.899
SMILESCC1(C)CCC(CN2CCN(CC2)c2ccc(C(=O)NS(=O)(=O)c3cnc(OCC4(F)CCN(CC(F)F)CC4)c(Cl)c3)c(Oc3cnc4[nH]ccc4c3)c2)=C(C1)c1ccc(Cl)cc1