Reaction Details
TargetApoptosis regulator Bcl-2
LigandBDBM189760
Substrate/Competitorn/a
Meas. Tech.Time Resolved-Fluorescence Resonance Energy Transfer (TR-FRET) Assay
Temperature298.15±n/a K
Ki<0.01±n/a nM
Commentsextracted
Citation Bruncko, MDing, HDoherty, GAElmore, SWHasvold, LAHexamer, LKunzer, ARSong, XSouers, AJSullivan, GMTao, ZWang, GTWang, LWang, XWendt, MDMantei, RAHansen, TM Apoptosis-inducing agents for the treatment of cancer and immune and autoimmune diseases US Patent US9174982 Publication Date 11/3/2015
 
Apoptosis regulator Bcl-2
Name:Apoptosis regulator Bcl-2
Type:Homodimer or heterodimer
Mol. Mass.:26269.11
Organism:Homo sapiens (Human)
Description:P10415
Residue:239
BDBM189760
NameBDBM189760
Synonyms:US10213433, Compound 330 US20240043404, Example 330 | US9174982, 330
TypeSmall organic molecule
Emp. Form.C47H51ClN8O7S
Mol. Mass.907.475
SMILES[O-][N+](=O)c1cc(ccc1NCC1CN(CCO1)C1CC1)S(=O)(=O)NC(=O)c1ccc(cc1Oc1cnc2[nH]ccc2c1)N1CCN(CC2=C(CC3(CC3)CC2)c2ccc(Cl)cc2)CC1