Reaction Details
TargetNeutrophil elastase
LigandBDBM189819
Substrate/Competitorn/a
Meas. Tech.Inhibition Assay
pH7.4±n/a
Temperature310.15±n/a K
IC50<0.3±n/a nM
Commentsextracted
Citation Von Nussbaum, FKarthaus, DAnlauf, SDelbeck, MLi, VMMeibom, DLustig, KSchamberger, J 4-(4-cyano-2-thioaryl)dihydropyrimidinones and use thereof US Patent US9174997 Publication Date 11/3/2015
 
Neutrophil elastase
Name:Neutrophil elastase
Type:Enzyme
Mol. Mass.:28532.38
Organism:Homo sapiens (Human)
Description:P08246
Residue:267
BDBM189819
NameBDBM189819
Synonyms:US9174997, 32
TypeSmall organic molecule
Emp. Form.C24H19F3N4O5S2
Mol. Mass.564.557
SMILESCC1=C([N+]#[C-])[C@H](N(C(=O)N1c1cccc(c1)C(F)(F)F)S(=O)(=O)C1CC1)c1ccc(cc1S(C)(=O)=O)C#N