Reaction Details
TargetHistone-lysine N-methyltransferase EZH2 [Y641N]
LigandBDBM190225
Substrate/Competitorn/a
Meas. Tech.Inhibition Assay
pH7.6±n/a
IC50 4100±n/a nM
Commentsextracted
Citation Kuntz, KWKnutson, SKWigle, TJ Inhibitors of human EZH2, and methods of use thereof US Patent US9175331 Publication Date 11/3/2015
 
Histone-lysine N-methyltransferase EZH2 [Y641N]
Name:Histone-lysine N-methyltransferase EZH2 [Y641N]
Type:Protein
Mol. Mass.:85318.77
Organism:Homo sapiens (Human)
Description:Q15910[Y641N]
Residue:746
BDBM190225
NameBDBM190225
Synonyms:US9175331, 75
TypeSmall organic molecule
Emp. Form.C24H33ClN8O5
Mol. Mass.549.022
SMILESNC(CCN(CCNCCc1ccc(Cl)cc1)CC1O[C@H]([C@H](O)[C@@H]1O)n1cnc2c(N)ncnc12)C(O)=O