Reaction Details
TargetHistone-lysine N-methyltransferase EZH2
LigandBDBM190184
Substrate/Competitorn/a
Meas. Tech.Inhibition Assay
IC50 2.5±n/a nM
Citation Kuntz, KWKnutson, SKWigle, TJ Inhibitors of human EZH2, and methods of use thereof US Patent US9175331 Publication Date 11/3/2015
 
Histone-lysine N-methyltransferase EZH2
Name:Histone-lysine N-methyltransferase EZH2
Type:Protein
Mol. Mass.:85367.84
Organism:Homo sapiens (Human)
Description:Q15910
Residue:746
BDBM190184
NameBDBM190184
Synonyms:EPZ006632 | US9175331, 10
TypeSmall organic molecule
Emp. Form.C36H48N5O3
Mol. Mass.598.798
SMILESCCN(C1CCOCC1)c1cc(cc(C(=O)NCc2c(C)cc(C)nc2=O)c1C)-c1ccc(CN2CCCN(C)CC2)cc1