Reaction Details
TargetHistone-lysine N-methyltransferase EZH2 [A677G]
LigandBDBM50075051
Substrate/Competitorn/a
Meas. Tech.Inhibition Assay
IC50 11.3±n/a nM
Citation Kuntz, KWKnutson, SKWigle, TJ Inhibitors of human EZH2, and methods of use thereof US Patent US9175331 Publication Date 11/3/2015
 
Histone-lysine N-methyltransferase EZH2 [A677G]
Name:Histone-lysine N-methyltransferase EZH2 [A677G]
Type:Protein
Mol. Mass.:85381.87
Organism:Homo sapiens (Human)
Description:Q15910[A677G]
Residue:746
BDBM50075051
NameBDBM50075051
Synonyms:CHEMBL3360855 US10273223, Compound C-1 US9637472, Compound C-1
TypeSmall organic molecule
Emp. Form.C32H37N5O3
Mol. Mass.539.6679
SMILESCc1cc(C)c(CNC(=O)c2cc(cc3n(ncc23)C2CCCC2)-c2ccc(CN3CCOCC3)cc2)c(=O)[nH]1