Reaction Details
TargetHistone-lysine N-methyltransferase EZH2 [A677G]
LigandBDBM172138
Substrate/Competitorn/a
Meas. Tech.Inhibition Assay
IC50 1.9±n/a nM
Citation Kuntz, KWKnutson, SKWigle, TJ Inhibitors of human EZH2, and methods of use thereof US Patent US9175331 Publication Date 11/3/2015
 
Histone-lysine N-methyltransferase EZH2 [A677G]
Name:Histone-lysine N-methyltransferase EZH2 [A677G]
Type:Protein
Mol. Mass.:85381.87
Organism:Homo sapiens (Human)
Description:Q15910[A677G]
Residue:746
BDBM172138
NameBDBM172138
Synonyms:EPZ007428 US11052093, Compound 145 US9175331, 16
TypeSmall organic molecule
Emp. Form.C30H42N6O2
Mol. Mass.518.6935
SMILESCCN([C@H]1CC[C@@H](CC1)N(C)C)c1cc(cc(C(=O)NCc2c(C)cc(C)[nH]c2=O)c1C)-c1cnn(C)c1