Reaction Details
TargetHistone-lysine N-methyltransferase EZH2 [A687V]
LigandBDBM190185
Substrate/Competitorn/a
Meas. Tech.Inhibition Assay
IC50 3.2±n/a nM
Citation Kuntz, KWKnutson, SKWigle, TJ Inhibitors of human EZH2, and methods of use thereof US Patent US9175331 Publication Date 11/3/2015
 
Histone-lysine N-methyltransferase EZH2 [A687V]
Name:Histone-lysine N-methyltransferase EZH2 [A687V]
Type:Protein
Mol. Mass.:85395.90
Organism:Homo sapiens (Human)
Description:Q15910[A687V]
Residue:746
BDBM190185
NameBDBM190185
Synonyms:EPZ007038 | US9175331, 11
TypeSmall organic molecule
Emp. Form.C26H36ClN4O2
Mol. Mass.472.043
SMILESCCN([C@H]1CC[C@@H](CC1)N(C)C)c1cc(Cl)cc(C(=O)NCc2c(C)cc(C)nc2=O)c1C