Reaction Details
TargetHistone-lysine N-methyltransferase EZH2 [A687V]
LigandBDBM190217
Substrate/Competitorn/a
Meas. Tech.Inhibition Assay
IC50 3.3±n/a nM
Citation Kuntz, KWKnutson, SKWigle, TJ Inhibitors of human EZH2, and methods of use thereof US Patent US9175331 Publication Date 11/3/2015
 
Histone-lysine N-methyltransferase EZH2 [A687V]
Name:Histone-lysine N-methyltransferase EZH2 [A687V]
Type:Protein
Mol. Mass.:85395.90
Organism:Homo sapiens (Human)
Description:Q15910[A687V]
Residue:746
BDBM190217
NameBDBM190217
Synonyms:EPZ009152 | US9175331, 54
TypeSmall organic molecule
Emp. Form.C27H36ClN3O4
Mol. Mass.502.045
SMILESCCOC(=O)[C@H]1CC[C@@H](CC1)N(CC)c1cc(Cl)cc(C(=O)NCc2c(C)cc(C)[nH]c2=O)c1C