Reaction Details
TargetHistone-lysine N-methyltransferase EZH2 [A687V]
LigandBDBM190222
Substrate/Competitorn/a
Meas. Tech.Inhibition Assay
IC50 43.6±n/a nM
Citation Kuntz, KWKnutson, SKWigle, TJ Inhibitors of human EZH2, and methods of use thereof US Patent US9175331 Publication Date 11/3/2015
 
Histone-lysine N-methyltransferase EZH2 [A687V]
Name:Histone-lysine N-methyltransferase EZH2 [A687V]
Type:Protein
Mol. Mass.:85395.90
Organism:Homo sapiens (Human)
Description:Q15910[A687V]
Residue:746
BDBM190222
NameBDBM190222
Synonyms:EPZ009157 | US9175331, 59
TypeSmall organic molecule
Emp. Form.C29H39ClN4O3
Mol. Mass.527.098
SMILESCCN([C@H]1CC[C@H](CC1)C(=O)N1CCCC1)c1cc(Cl)cc(C(=O)NCc2c(C)cc(C)[nH]c2=O)c1C