Reaction Details
TargetHistone-lysine N-methyltransferase EZH2 [A687V]
LigandBDBM172176
Substrate/Competitorn/a
Meas. Tech.Inhibition Assay
IC50 1.1±n/a nM
Citation Kuntz, KWKnutson, SKWigle, TJ Inhibitors of human EZH2, and methods of use thereof US Patent US9175331 Publication Date 11/3/2015
 
Histone-lysine N-methyltransferase EZH2 [A687V]
Name:Histone-lysine N-methyltransferase EZH2 [A687V]
Type:Protein
Mol. Mass.:85395.90
Organism:Homo sapiens (Human)
Description:Q15910[A687V]
Residue:746
BDBM172176
NameBDBM172176
Synonyms:EPZ009161 US11052093, Compound 184 US9175331, 61
TypeSmall organic molecule
Emp. Form.C34H46N6O3
Mol. Mass.586.7674
SMILESCCCc1cc(C)[nH]c(=O)c1CNC(=O)c1cc(cc(N(CC)C2CCOCC2)c1C)-c1ccc(nc1)N1CCNCC1