Reaction Details
TargetArachidonate 15-lipoxygenase
LigandBDBM190650
Substrate/Competitorn/a
Meas. Tech.LoxA Selectivity Assay
pH7±n/a
Temperature298.15±n/a K
IC50 2.6e+3± 4e+2 nM
Commentsextracted
Citation Deschamps, JDOgunsola, AFJameson, JBYasgar, AFlitter, BAFreedman, CJMelvin, JANguyen, JVMaloney, DJJadhav, ASimeonov, ABomberger, JMHolman, TR Biochemical and Cellular Characterization and Inhibitor Discovery of Pseudomonas aeruginosa 15-Lipoxygenase. Biochemistry55:3329-40 (2016) 
 
Arachidonate 15-lipoxygenase
Name:Arachidonate 15-lipoxygenase
Synonyms:15-Lipoxygenase (LoxA)
Type:Protein
Mol. Mass.:74804.41
Organism:Pseudomonas aeruginosa
Description:n/a
Residue:685
BDBM190650
NameBDBM190650
TypeSmall organic molecule
Emp. Form.C18H21ClO2
Mol. Mass.304.811
SMILESCCCCCCc1ccc(Oc2ccccc2Cl)c(O)c1