Reaction Details
TargetBeta-secretase 2
LigandBDBM190700
Substrate/Competitorn/a
Meas. Tech.HTRF FRET Assay
pH5±n/a
Temperature303.15±n/a K
Ki 0.5±n/a nM
Commentsextracted
Citation Wu, WBurnett, DAStamford, AWCumming, JNAsberom, TBennett, CSasiskumar, TKScott, JD 2-spiro-substituted iminothiazines and their mono-and dioxides as bace inhibitors, compositions and their use US Patent US9181236 Publication Date 11/10/2015
 
Beta-secretase 2
Name:Beta-secretase 2
Type:Protein
Mol. Mass.:56171.20
Organism:Homo sapiens (Human)
Description:Q9Y5Z0
Residue:518
BDBM190700
NameBDBM190700
Synonyms:US9181236, 4
TypeSmall organic molecule
Emp. Form.C19H17F3N4O3S
Mol. Mass.438.423
SMILESC[C@]1(CS(=O)(=O)C2(CC2)C(=N)N1)c1cc(NC(=O)c2ncc(F)cc2F)ccc1F