Reaction Details
TargetBeta-secretase 2
LigandBDBM190711
Substrate/Competitorn/a
Meas. Tech.HTRF FRET Assay
pH5±n/a
Temperature303.15±n/a K
Ki 0.6±n/a nM
Commentsextracted
Citation Wu, WBurnett, DAStamford, AWCumming, JNAsberom, TBennett, CSasiskumar, TKScott, JD 2-spiro-substituted iminothiazines and their mono-and dioxides as bace inhibitors, compositions and their use US Patent US9181236 Publication Date 11/10/2015
 
Beta-secretase 2
Name:Beta-secretase 2
Type:Protein
Mol. Mass.:56171.20
Organism:Homo sapiens (Human)
Description:Q9Y5Z0
Residue:518
BDBM190711
NameBDBM190711
Synonyms:US9181236, 15
TypeSmall organic molecule
Emp. Form.C22H25FN4O4S
Mol. Mass.460.522
SMILESCOc1ccc(nc1)C(=O)Nc1ccc(F)c(c1)[C@]1(C)CS(=O)(=O)C2(CCCC2)C(=N)N1