Reaction Details
TargetSerine/threonine-protein kinase pim-1
LigandBDBM191132
Substrate/Competitorn/a
Meas. Tech.Trans-Phosphorylation Assay
pH7.5±n/a
IC50 8±n/a nM
Commentsextracted
Citation Casuscelli, FBadari, AOrrenius, SCPiutti, CDisingrini, T Substituted 3,4-dihydropyrrolo[1,2-a]pyrazin-1(2H)-ones as protein kinase inhibitors US Patent US9181258 Publication Date 11/10/2015
 
Serine/threonine-protein kinase pim-1
Name:Serine/threonine-protein kinase pim-1
Type:Protein
Mol. Mass.:35681.82
Organism:Homo sapiens (Human)
Description:P11309
Residue:313
BDBM191132
NameBDBM191132
Synonyms:US9181258, 148
TypeSmall organic molecule
Emp. Form.C24H24F3N5O2
Mol. Mass.471.4749
SMILESCc1cccc(c1)-c1c(cc2C(=O)NC[C@H](CCNC(N)=N)n12)-c1cccc(OC(F)(F)F)c1