Reaction Details
TargetSerine/threonine-protein kinase pim-2
LigandBDBM191102
Substrate/Competitorn/a
Meas. Tech.Trans-Phosphorylation Assay
pH7.5±n/a
IC50 7±n/a nM
Commentsextracted
Citation Casuscelli, FBadari, AOrrenius, SCPiutti, CDisingrini, T Substituted 3,4-dihydropyrrolo[1,2-a]pyrazin-1(2H)-ones as protein kinase inhibitors US Patent US9181258 Publication Date 11/10/2015
 
Serine/threonine-protein kinase pim-2
Name:Serine/threonine-protein kinase pim-2
Type:Serine/threonine-protein kinase
Mol. Mass.:34185.93
Organism:Homo sapiens (Human)
Description:Q9P1W9
Residue:311
BDBM191102
NameBDBM191102
Synonyms:US9181258, 99
TypeSmall organic molecule
Emp. Form.C27H29F3N4O3
Mol. Mass.514.5394
SMILESNCC[C@H]1CNC(=O)c2cc(c(-c3ccc(CN4CCOCC4)cc3)n12)-c1cccc(OC(F)(F)F)c1