Reaction Details
TargetLysine-specific demethylase 5B
LigandBDBM191596
Substrate/Competitorn/a
Meas. Tech.AlphaLISA Assay
pH7.2±n/a
Temperature298.15±n/a K
IC50 1.1e+2± 1e+1 nM
Commentsextracted
Citation Horton, JRLiu, XGale, MWu, LShanks, JRZhang, XWebber, PJBell, JSKales, SCMott, BTRai, GJansen, DJHenderson, MJUrban, DJHall, MDSimeonov, AMaloney, DJJohns, MAFu, HJadhav, AVertino, PMYan, QCheng, X Structural Basis for KDM5A Histone Lysine Demethylase Inhibition by Diverse Compounds. Cell Chem Biol23:769-81 (2016) 
 
Lysine-specific demethylase 5B
Name:Lysine-specific demethylase 5B
Type:Protein
Mol. Mass.:175659.67
Organism:Homo sapiens (Human)
Description:Q9UGL1
Residue:1544
BDBM191596
NameBDBM191596
Synonyms:6-isopropyl-5-methyl-7-oxo-4,7-dihydropyrazolo[1,5-a]pyrimidine-3-carbonitrile (N8)
TypeSmall organic molecule
Emp. Form.C11H12N4O
Mol. Mass.216.2392
SMILESCC(C)c1c(C)[nH]c2c(cnn2c1=O)C#N